Observed the following build error: --- CC drivers/macintosh/mediabay.o In file included from drivers/macintosh/mediabay.c:21: include/linux/ide.h:605: error: field ‘request_sense_rq’ has incomplete type make[2]: *** [drivers/macintosh/mediabay.o] Error 1 make[1]: *** [drivers/macintosh] Error 2 make: *** [drivers] Error 2 --- Regards-- Subrata