* Oleg Nesterov wrote: > COMPLETELY UNTESTED. FYI, build failure on x86/64: kernel/compat.c: In function 'compat_sys_nanosleep': kernel/compat.c:90: error: 'err' undeclared (first use in this function) kernel/compat.c:90: error: (Each undeclared identifier is reported only once kernel/compat.c:90: error: for each function it appears in.) config attached. Ingo