From: kbuild test robot <lkp@intel.com>
To: Alexey Brodkin <Alexey.Brodkin@synopsys.com>
Cc: kbuild-all@01.org, linux-kernel@vger.kernel.org,
linux-snps-arc@lists.infradead.org, linux-arch@vger.kernel.org,
Alexey Brodkin <Alexey.Brodkin@synopsys.com>,
Will Deacon <will.deacon@arm.com>,
Peter Zijlstra <peterz@infradead.org>,
Boqun Feng <boqun.feng@gmail.com>,
Russell King <linux@armlinux.org.uk>,
Arnd Bergmann <arnd@arndb.de>,
Thomas Gleixner <tglx@linutronix.de>,
Ingo Molnar <mingo@redhat.com>,
Darren Hart <dvhart@infradead.org>, Shuah Khan <shuah@kernel.org>,
"Paul E. McKenney" <paulmck@linux.vnet.ibm.com>,
Josh Triplett <josh@joshtriplett.org>,
Steven Rostedt <rostedt@goodmis.org>,
Mathieu Desnoyers <mathieu.desnoyers@efficios.com>,
Lai Jiangshan <jiangshanlai@gmail.com>,
David Laight <David.Laight@ACULAB.COM>,
Geert Uytterhoeven <geert@linux-m68k.org>,
Greg Kroah-Hartman <gregkh@linuxfoundation.org>
Subject: Re: [PATCH] atomic{64}_t: Explicitly specify data storage length and alignment
Date: Tue, 10 Jul 2018 00:25:26 +0800 [thread overview]
Message-ID: <201807100049.6L1a0lqf%fengguang.wu@intel.com> (raw)
In-Reply-To: <20180709124741.21037-1-abrodkin@synopsys.com>
[-- Attachment #1: Type: text/plain, Size: 6783 bytes --]
Hi Alexey,
I love your patch! Yet something to improve:
[auto build test ERROR on linus/master]
[also build test ERROR on v4.18-rc4 next-20180709]
[if your patch is applied to the wrong git tree, please drop us a note to help improve the system]
url: https://github.com/0day-ci/linux/commits/Alexey-Brodkin/atomic-64-_t-Explicitly-specify-data-storage-length-and-alignment/20180709-223920
config: x86_64-acpi-redef (attached as .config)
compiler: gcc-7 (Debian 7.3.0-16) 7.3.0
reproduce:
# save the attached .config to linux build tree
make ARCH=x86_64
All errors (new ones prefixed by >>):
In file included from tools/objtool/arch/x86/include/asm/orc_types.h:21:0,
from orc.h:21,
from orc_dump.c:19:
>> tools/include/linux/types.h:62:16: error: expected declaration specifiers or '...' before numeric constant
u32 __aligned(4) counter;
^
tools/include/linux/types.h:63:1: error: no semicolon at end of struct or union [-Werror]
} atomic_t;
^
In file included from tools/objtool/arch/x86/include/asm/orc_types.h:21:0,
from orc.h:21,
from orc_gen.c:21:
>> tools/include/linux/types.h:62:16: error: expected declaration specifiers or '...' before numeric constant
u32 __aligned(4) counter;
^
tools/include/linux/types.h:63:1: error: no semicolon at end of struct or union [-Werror]
} atomic_t;
^
In file included from tools/include/linux/string.h:5:0,
from ../lib/string.c:19:
>> tools/include/linux/types.h:62:16: error: expected declaration specifiers or '...' before numeric constant
u32 __aligned(4) counter;
^
tools/include/linux/types.h:63:1: error: no semicolon at end of struct or union [-Werror]
} atomic_t;
^
cc1: all warnings being treated as errors
>> mv: cannot stat 'tools/objtool/.libstring.o.tmp': No such file or directory
make[4]: *** [tools/objtool/libstring.o] Error 1
In file included from tools/include/linux/string.h:5:0,
from ../lib/str_error_r.c:5:
>> tools/include/linux/types.h:62:16: error: expected declaration specifiers or '...' before numeric constant
u32 __aligned(4) counter;
^
tools/include/linux/types.h:63:1: error: no semicolon at end of struct or union [-Werror]
} atomic_t;
^
cc1: all warnings being treated as errors
In file included from tools/include/linux/list.h:5:0,
from elf.h:23,
from elf.c:31:
>> tools/include/linux/types.h:62:16: error: expected declaration specifiers or '...' before numeric constant
u32 __aligned(4) counter;
^
tools/include/linux/types.h:63:1: error: no semicolon at end of struct or union [-Werror]
} atomic_t;
^
In file included from tools/include/linux/list.h:5:0,
from elf.h:23,
from special.h:22,
from special.c:26:
>> tools/include/linux/types.h:62:16: error: expected declaration specifiers or '...' before numeric constant
u32 __aligned(4) counter;
^
tools/include/linux/types.h:63:1: error: no semicolon at end of struct or union [-Werror]
} atomic_t;
^
mv: cannot stat 'tools/objtool/.str_error_r.o.tmp': No such file or directory
make[4]: *** [tools/objtool/str_error_r.o] Error 1
In file included from tools/include/linux/string.h:5:0,
from run-command.c:7:
>> tools/include/linux/types.h:62:16: error: expected declaration specifiers or '...' before numeric constant
u32 __aligned(4) counter;
^
tools/include/linux/types.h:63:1: error: no semicolon at end of struct or union [-Werror]
} atomic_t;
^
cc1: all warnings being treated as errors
mv: cannot stat 'tools/objtool/.orc_dump.o.tmp': No such file or directory
make[4]: *** [tools/objtool/orc_dump.o] Error 1
In file included from tools/include/linux/string.h:5:0,
from help.c:5:
>> tools/include/linux/types.h:62:16: error: expected declaration specifiers or '...' before numeric constant
u32 __aligned(4) counter;
^
tools/include/linux/types.h:63:1: error: no semicolon at end of struct or union [-Werror]
} atomic_t;
^
cc1: all warnings being treated as errors
mv: cannot stat 'tools/objtool/.special.o.tmp': No such file or directory
make[4]: *** [tools/objtool/special.o] Error 1
cc1: all warnings being treated as errors
cc1: all warnings being treated as errors
mv: cannot stat 'tools/objtool/.run-command.o.tmp': No such file or directory
make[5]: *** [tools/objtool/run-command.o] Error 1
mv: cannot stat 'tools/objtool/.orc_gen.o.tmp': No such file or directory
make[4]: *** [tools/objtool/orc_gen.o] Error 1
cc1: all warnings being treated as errors
mv: cannot stat 'tools/objtool/.help.o.tmp': No such file or directory
make[5]: *** [tools/objtool/help.o] Error 1
cc1: all warnings being treated as errors
mv: cannot stat 'tools/objtool/.elf.o.tmp': No such file or directory
make[4]: *** [tools/objtool/elf.o] Error 1
In file included from tools/include/linux/list.h:5:0,
from arch/x86/../../elf.h:23,
from arch/x86/decode.c:26:
>> tools/include/linux/types.h:62:16: error: expected declaration specifiers or '...' before numeric constant
u32 __aligned(4) counter;
^
tools/include/linux/types.h:63:1: error: no semicolon at end of struct or union [-Werror]
} atomic_t;
^
cc1: all warnings being treated as errors
mv: cannot stat 'tools/objtool/arch/x86/.decode.o.tmp': No such file or directory
make[5]: *** [tools/objtool/arch/x86/decode.o] Error 1
make[5]: Target '__build' not remade because of errors.
make[4]: *** [arch/x86] Error 2
make[5]: Target '__build' not remade because of errors.
make[4]: *** [tools/objtool/libsubcmd-in.o] Error 2
make[4]: Target 'all' not remade because of errors.
make[3]: *** [tools/objtool/libsubcmd.a] Error 2
make[4]: Target '__build' not remade because of errors.
make[3]: *** [tools/objtool/objtool-in.o] Error 2
make[3]: Target 'all' not remade because of errors.
make[2]: *** [objtool] Error 2
make[1]: *** [tools/objtool] Error 2
make[1]: Target 'prepare' not remade because of errors.
make: *** [sub-make] Error 2
vim +62 tools/include/linux/types.h
60
61 typedef struct {
> 62 u32 __aligned(4) counter;
63 } atomic_t;
64
---
0-DAY kernel test infrastructure Open Source Technology Center
https://lists.01.org/pipermail/kbuild-all Intel Corporation
[-- Attachment #2: .config.gz --]
[-- Type: application/gzip, Size: 30712 bytes --]
next prev parent reply other threads:[~2018-07-09 16:26 UTC|newest]
Thread overview: 11+ messages / expand[flat|nested] mbox.gz Atom feed top
2018-07-09 12:47 Alexey Brodkin
2018-07-09 12:55 ` Geert Uytterhoeven
2018-07-09 13:07 ` Will Deacon
2018-07-09 13:30 ` David Laight
2018-07-09 13:49 ` Geert Uytterhoeven
2018-07-09 13:35 ` Peter Zijlstra
2018-07-09 14:30 ` Alexey Brodkin
2018-07-09 14:45 ` Peter Zijlstra
2018-07-09 14:04 ` Russell King - ARM Linux
2018-07-09 16:25 ` kbuild test robot [this message]
2018-07-09 18:05 ` kbuild test robot
Reply instructions:
You may reply publicly to this message via plain-text email
using any one of the following methods:
* Save the following mbox file, import it into your mail client,
and reply-to-all from there: mbox
Avoid top-posting and favor interleaved quoting:
https://en.wikipedia.org/wiki/Posting_style#Interleaved_style
* Reply using the --to, --cc, and --in-reply-to
switches of git-send-email(1):
git send-email \
--in-reply-to=201807100049.6L1a0lqf%fengguang.wu@intel.com \
--to=lkp@intel.com \
--cc=Alexey.Brodkin@synopsys.com \
--cc=David.Laight@ACULAB.COM \
--cc=arnd@arndb.de \
--cc=boqun.feng@gmail.com \
--cc=dvhart@infradead.org \
--cc=geert@linux-m68k.org \
--cc=gregkh@linuxfoundation.org \
--cc=jiangshanlai@gmail.com \
--cc=josh@joshtriplett.org \
--cc=kbuild-all@01.org \
--cc=linux-arch@vger.kernel.org \
--cc=linux-kernel@vger.kernel.org \
--cc=linux-snps-arc@lists.infradead.org \
--cc=linux@armlinux.org.uk \
--cc=mathieu.desnoyers@efficios.com \
--cc=mingo@redhat.com \
--cc=paulmck@linux.vnet.ibm.com \
--cc=peterz@infradead.org \
--cc=rostedt@goodmis.org \
--cc=shuah@kernel.org \
--cc=tglx@linutronix.de \
--cc=will.deacon@arm.com \
/path/to/YOUR_REPLY
https://kernel.org/pub/software/scm/git/docs/git-send-email.html
* If your mail client supports setting the In-Reply-To header
via mailto: links, try the mailto: link
Be sure your reply has a Subject: header at the top and a blank line
before the message body.
This is a public inbox, see mirroring instructions
for how to clone and mirror all data and code used for this inbox
all inboxes | Powered by JetHome®