Hi, all! Just for the record - linux kernel version 2.6.22-git10 fails to build with the following error: In file included from net/netfilter/xt_connlimit.c:27: include/net/netfilter/nf_conntrack.h:99: error: field `ct_general' has incomplete type include/net/netfilter/nf_conntrack.h: In function `nf_ct_get': include/net/netfilter/nf_conntrack.h:163: error: structure has no member named `nfct' include/net/netfilter/nf_conntrack.h: In function `nf_ct_put': include/net/netfilter/nf_conntrack.h:170: error: implicit declaration of function `nf_conntrack_put' include/net/netfilter/nf_conntrack.h: In function `nf_ct_is_untracked': include/net/netfilter/nf_conntrack.h:252: error: structure has no member named `nfct' In file included from net/netfilter/xt_connlimit.c:28: include/net/netfilter/nf_conntrack_core.h: In function `nf_conntrack_confirm': include/net/netfilter/nf_conntrack_core.h:68: error: structure has no member named `nfct' make[2]: *** [net/netfilter/xt_connlimit.o] Error 1 make[1]: *** [net/netfilter] Error 2 make: *** [net] Error 2 Attached is the kernel config used, system is running Slackware 11 on AMD Duron, gcc version is 3.4.6. For more info - mail me. -- Plamen Petrov, network administrator Technical College - Silistra, RU "Angel Kantchev" http://tk.ru.acad.bg/