* 2.6.18-rc5-git3 SMP fails compile
@ 2006-08-31 13:05 Pete Clements
2006-08-31 13:14 ` Jesper Juhl
0 siblings, 1 reply; 2+ messages in thread
From: Pete Clements @ 2006-08-31 13:05 UTC (permalink / raw)
To: linux-kernel
fyi:
2.6.18-rc5-git3 fails compile with SMP.
CC arch/i386/kernel/asm-offsets.s
In file included from include/linux/spinlock.h:86,
from include/linux/capability.h:45,
from include/linux/sched.h:44,
from include/linux/module.h:9,
from include/linux/crypto.h:20,
from arch/i386/kernel/asm-offsets.c:7:
include/asm/spinlock.h: In function '__raw_read_lock':
include/asm/spinlock.h:164: error: expected '(' before ')' token
include/asm/spinlock.h:164: error: output operand constraint lacks '='
include/asm/spinlock.h:164: error: output operand constraint lacks '='
include/asm/spinlock.h:164: error: invalid lvalue in asm output 0
make[1]: *** [arch/i386/kernel/asm-offsets.s] Error 1
make: *** [prepare0] Error 2
--
Pete Clements
^ permalink raw reply [flat|nested] 2+ messages in thread
end of thread, other threads:[~2006-08-31 13:14 UTC | newest]
Thread overview: 2+ messages (download: mbox.gz / follow: Atom feed)
-- links below jump to the message on this page --
2006-08-31 13:05 2.6.18-rc5-git3 SMP fails compile Pete Clements
2006-08-31 13:14 ` Jesper Juhl
This is a public inbox, see mirroring instructions
for how to clone and mirror all data and code used for this inbox
all inboxes | Powered by JetHome®