mirror of https://lore.kernel.org/lkml/
 help / color / mirror / Atom feed
* htmldocs: <built-in>:1:10: fatal error: './include/linux/compiler-version.h' file not found
@ 2024-10-16 19:06 kernel test robot
  0 siblings, 0 replies; only message in thread
From: kernel test robot @ 2024-10-16 19:06 UTC (permalink / raw)
  To: Masahiro Yamada; +Cc: oe-kbuild-all, linux-kernel, Kees Cook

tree:   https://git.kernel.org/pub/scm/linux/kernel/git/torvalds/linux.git master
head:   2f87d0916ce0d2925cedbc9e8f5d6291ba2ac7b2
commit: ce6ed1c4c9876c2880f52f18c41ef2a30d070bc5 kbuild: rebuild GCC plugins when the compiler is upgraded
date:   3 years, 7 months ago
reproduce: (https://download.01.org/0day-ci/archive/20241017/202410170214.gy9lNemy-lkp@intel.com/reproduce)

If you fix the issue in a separate patch/commit (i.e. not just a new version of
the same patch/commit), kindly add following tags
| Reported-by: kernel test robot <lkp@intel.com>
| Closes: https://lore.kernel.org/oe-kbuild-all/202410170214.gy9lNemy-lkp@intel.com/

All errors (new ones prefixed by >>):

>> <built-in>:1:10: fatal error: './include/linux/compiler-version.h' file not found
       1 | #include "./include/linux/compiler-version.h"
         |          ^~~~~~~~~~~~~~~~~~~~~~~~~~~~~~~~~~~~
   1 error generated.
>> <built-in>:1:10: fatal error: './include/linux/compiler-version.h' file not found
       1 | #include "./include/linux/compiler-version.h"
         |          ^~~~~~~~~~~~~~~~~~~~~~~~~~~~~~~~~~~~
   1 error generated.
   make[1]: *** [scripts/Makefile.build:116: scripts/mod/devicetable-offsets.s] Error 1
   make[1]: *** [scripts/Makefile.build:271: scripts/mod/empty.o] Error 1

-- 
0-DAY CI Kernel Test Service
https://github.com/intel/lkp-tests/wiki

^ permalink raw reply	[flat|nested] only message in thread

only message in thread, other threads:[~2024-10-16 19:06 UTC | newest]

Thread overview: (only message) (download: mbox.gz / follow: Atom feed)
-- links below jump to the message on this page --
2024-10-16 19:06 htmldocs: <built-in>:1:10: fatal error: './include/linux/compiler-version.h' file not found kernel test robot

This is a public inbox, see mirroring instructions
for how to clone and mirror all data and code used for this inbox

all inboxes | Powered by JetHome®