* make[2]: *** No rule to make target 'install'.
@ 2024-12-15 18:32 kernel test robot
2024-12-16 0:46 ` Philip Li
0 siblings, 1 reply; 2+ messages in thread
From: kernel test robot @ 2024-12-15 18:32 UTC (permalink / raw)
To: Jan Kara; +Cc: oe-kbuild-all, linux-kernel, Christian Brauner
tree: https://git.kernel.org/pub/scm/linux/kernel/git/torvalds/linux.git master
head: 2d8308bf5b67dff50262d8a9260a50113b3628c6
commit: e719b4d156749f02eafed31a3c515f2aa9dcc72a block: Provide bdev_open_* functions
date: 1 year, 2 months ago
config: csky-allnoconfig (https://download.01.org/0day-ci/archive/20241216/202412160224.YwRnvCXq-lkp@intel.com/config)
compiler: csky-linux-gcc (GCC) 12.4.0
reproduce (this is a W=1 build): (https://download.01.org/0day-ci/archive/20241216/202412160224.YwRnvCXq-lkp@intel.com/reproduce)
If you fix the issue in a separate patch/commit (i.e. not just a new version of
the same patch/commit), kindly add following tags
| Reported-by: kernel test robot <lkp@intel.com>
| Closes: https://lore.kernel.org/oe-kbuild-all/202412160224.YwRnvCXq-lkp@intel.com/
All errors (new ones prefixed by >>):
>> make[2]: *** No rule to make target 'install'.
make[1]: *** [Makefile:234: __sub-make] Error 2
make[1]: Target 'install' not remade because of errors.
make: *** [Makefile:234: __sub-make] Error 2
make: Target 'install' not remade because of errors.
--
0-DAY CI Kernel Test Service
https://github.com/intel/lkp-tests/wiki
^ permalink raw reply [flat|nested] 2+ messages in thread
* Re: make[2]: *** No rule to make target 'install'.
2024-12-15 18:32 make[2]: *** No rule to make target 'install' kernel test robot
@ 2024-12-16 0:46 ` Philip Li
0 siblings, 0 replies; 2+ messages in thread
From: Philip Li @ 2024-12-16 0:46 UTC (permalink / raw)
To: kernel test robot
Cc: Jan Kara, oe-kbuild-all, linux-kernel, Christian Brauner
On Mon, Dec 16, 2024 at 02:32:45AM +0800, kernel test robot wrote:
> tree: https://git.kernel.org/pub/scm/linux/kernel/git/torvalds/linux.git master
> head: 2d8308bf5b67dff50262d8a9260a50113b3628c6
> commit: e719b4d156749f02eafed31a3c515f2aa9dcc72a block: Provide bdev_open_* functions
> date: 1 year, 2 months ago
> config: csky-allnoconfig (https://download.01.org/0day-ci/archive/20241216/202412160224.YwRnvCXq-lkp@intel.com/config)
> compiler: csky-linux-gcc (GCC) 12.4.0
> reproduce (this is a W=1 build): (https://download.01.org/0day-ci/archive/20241216/202412160224.YwRnvCXq-lkp@intel.com/reproduce)
>
> If you fix the issue in a separate patch/commit (i.e. not just a new version of
> the same patch/commit), kindly add following tags
> | Reported-by: kernel test robot <lkp@intel.com>
> | Closes: https://lore.kernel.org/oe-kbuild-all/202412160224.YwRnvCXq-lkp@intel.com/
>
> All errors (new ones prefixed by >>):
Sorry, kindly ignore this false positive report. We will check and fix what is wrong.
>
> >> make[2]: *** No rule to make target 'install'.
> make[1]: *** [Makefile:234: __sub-make] Error 2
> make[1]: Target 'install' not remade because of errors.
> make: *** [Makefile:234: __sub-make] Error 2
> make: Target 'install' not remade because of errors.
>
> --
> 0-DAY CI Kernel Test Service
> https://github.com/intel/lkp-tests/wiki
>
^ permalink raw reply [flat|nested] 2+ messages in thread
end of thread, other threads:[~2024-12-16 0:46 UTC | newest]
Thread overview: 2+ messages (download: mbox.gz / follow: Atom feed)
-- links below jump to the message on this page --
2024-12-15 18:32 make[2]: *** No rule to make target 'install' kernel test robot
2024-12-16 0:46 ` Philip Li
This is a public inbox, see mirroring instructions
for how to clone and mirror all data and code used for this inbox
all inboxes | Powered by JetHome®