mirror of https://lore.kernel.org/lkml/
 help / color / mirror / Atom feed
* info: errors on compiling staging drivers
@ 2009-01-18 14:48 We La
  2009-01-21  6:50 ` Greg KH
  0 siblings, 1 reply; 2+ messages in thread
From: We La @ 2009-01-18 14:48 UTC (permalink / raw)
  To: linux-kernel

Compiling staging drivers for 2.6.29-rc2-git1 with Linux SYS on an MI wind u100 i get the following error messages:  (see below)  No other error messages on the whole kernel compilation. I inform about this that the drivers can be corrected

w.landgraf@yahoo.com
Linux SYS  ftp://ftp5.gwdg.de/pub/linux/install/sys/

==============================
  OBJCOPY arch/x86/boot/setup.bin
  OBJCOPY arch/x86/boot/vmlinux.bin
  HOSTCC  arch/x86/boot/tools/build
  BUILD   arch/x86/boot/bzImage
Root device is (3, 1)
Setup is 11900 bytes (padded to 12288 bytes).
System is 4966 kB
CRC 8fafedc9
Kernel: arch/x86/boot/bzImage is ready  (#1)
  Building modules, stage 2.
  MODPOST 2336 modules
ERROR: "__set_irq_handler" [drivers/mfd/pcf50633-core.ko] undefined!
ERROR: "handle_level_irq" [drivers/mfd/pcf50633-core.ko] undefined!
WARNING: modpost: Found 4 section mismatch(es).
To see full details build your kernel with:
'make CONFIG_DEBUG_SECTION_MISMATCH=y'
make[1]: [__modpost] Error 1 (ignored)
  CC      arch/x86/crypto/crc32c-intel.mod.o
  LD [M]  arch/x86/crypto/crc32c-intel.ko
  CC      arch/x86/crypto/salsa20-i586.mod.o
  LD [M]  arch/x86/crypto/salsa20-i586.ko

.....

  CC      drivers/staging/staging.o
  LD      drivers/staging/agnx/built-in.o
  CC [M]  drivers/staging/agnx/rf.o
  CC [M]  drivers/staging/agnx/pci.o
drivers/staging/agnx/pci.c:426: warning: initialization from incompatible pointer type
  CC [M]  drivers/staging/agnx/xmit.o
  CC [M]  drivers/staging/agnx/table.o
  CC [M]  drivers/staging/agnx/sta.o
/usr/src/linux-2.6.29-rc2-git1-i486-1sys/arch/x86/include/asm/io_32.h: In function 'memcpy_fromio':
/usr/src/linux-2.6.29-rc2-git1-i486-1sys/arch/x86/include/asm/io_32.h:151: warning: passing argument 2 of '__memcpy' discards qualifiers from pointer target type
/usr/src/linux-2.6.29-rc2-git1-i486-1sys/arch/x86/include/asm/io_32.h: In function 'memcpy_toio':
/usr/src/linux-2.6.29-rc2-git1-i486-1sys/arch/x86/include/asm/io_32.h:157: warning: passing argument 1 of '__memcpy' discards qualifiers from pointer target type
  CC [M]  drivers/staging/agnx/phy.o
/usr/src/linux-2.6.29-rc2-git1-i486-1sys/arch/x86/include/asm/io_32.h: In function 'memset_io':
/usr/src/linux-2.6.29-rc2-git1-i486-1sys/arch/x86/include/asm/io_32.h:145: warning: passing argument 1 of '__constant_c_and_count_memset' discards qualifiers from pointer target type
/usr/src/linux-2.6.29-rc2-git1-i486-1sys/arch/x86/include/asm/io_32.h:145: warning: passing argument 1 of '__constant_c_memset' discards qualifiers from pointer target type
/usr/src/linux-2.6.29-rc2-git1-i486-1sys/arch/x86/include/asm/io_32.h:145: warning: passing argument 1 of '__memset_generic' discards qualifiers from pointer target type
/usr/src/linux-2.6.29-rc2-git1-i486-1sys/arch/x86/include/asm/io_32.h:145: warning: passing argument 1 of '__memset_generic' discards qualifiers from pointer target type
  LD [M]  drivers/staging/agnx/agnx.o
  LD      drivers/staging/altpciechdma/built-in.o
  CC [M]  drivers/staging/altpciechdma/altpciechdma.o
drivers/staging/altpciechdma/altpciechdma.c: In function 'dma_test':
drivers/staging/altpciechdma/altpciechdma.c:541: warning: cast from pointer to integer of different size
drivers/staging/altpciechdma/altpciechdma.c:548: warning: assignment makes integer from pointer without a cast
drivers/staging/altpciechdma/altpciechdma.c: In function 'probe':
drivers/staging/altpciechdma/altpciechdma.c:803: warning: cast from pointer to integer of different size
drivers/staging/altpciechdma/altpciechdma.c:931: warning: label 'err_rev' defined but not used
drivers/staging/altpciechdma/altpciechdma.c:914: warning: label 'err_cdev' defined but not used
drivers/staging/altpciechdma/altpciechdma.c: At top level:
drivers/staging/altpciechdma/altpciechdma.c:416: warning: 'ape_sg_to_chdma_table' defined but not used
  CC      drivers/staging/android/binder.o
  CC      drivers/staging/android/ram_console.o
  CC      drivers/staging/android/lowmemorykiller.o
  LD      drivers/staging/android/built-in.o
  CC [M]  drivers/staging/android/logger.o
  CC [M]  drivers/staging/android/timed_gpio.o
drivers/staging/android/timed_gpio.c:21:27: error: asm/arch/gpio.h: No such file or directory
drivers/staging/android/timed_gpio.c: In function 'gpio_timer_func':
drivers/staging/android/timed_gpio.c:41: error: implicit declaration of function 'gpio_direction_output'
drivers/staging/android/timed_gpio.c: In function 'gpio_enable_show':
drivers/staging/android/timed_gpio.c:52: error: 'ktime_t' has no member named 'tv'
drivers/staging/android/timed_gpio.c:52: error: 'ktime_t' has no member named 'tv'
make[3]: [drivers/staging/android/timed_gpio.o] Error 1 (ignored)
  LD      drivers/staging/asus_oled/built-in.o
  CC [M]  drivers/staging/asus_oled/asus_oled.o
  LD      drivers/staging/at76_usb/built-in.o
  CC [M]  drivers/staging/at76_usb/at76_usb.o
  LD      drivers/staging/benet/built-in.o
  CC [M]  drivers/staging/benet/be_init.o
  CC [M]  drivers/staging/benet/be_int.o
  CC [M]  drivers/staging/benet/be_netif.o
  CC [M]  drivers/staging/benet/be_ethtool.o
  CC [M]  drivers/staging/benet/funcobj.o
  CC [M]  drivers/staging/benet/cq.o
  CC [M]  drivers/staging/benet/eq.o
  CC [M]  drivers/staging/benet/mpu.o
  CC [M]  drivers/staging/benet/eth.o
  LD [M]  drivers/staging/benet/benet.o
  LD      drivers/staging/comedi/built-in.o
  CC [M]  drivers/staging/comedi/comedi_fops.o






      


^ permalink raw reply	[flat|nested] 2+ messages in thread

* Re: info: errors on compiling staging drivers
  2009-01-18 14:48 info: errors on compiling staging drivers We La
@ 2009-01-21  6:50 ` Greg KH
  0 siblings, 0 replies; 2+ messages in thread
From: Greg KH @ 2009-01-21  6:50 UTC (permalink / raw)
  To: We La; +Cc: linux-kernel

On Sun, Jan 18, 2009 at 06:48:42AM -0800, We La wrote:
> Compiling staging drivers for 2.6.29-rc2-git1 with Linux SYS on an MI
> wind u100 i get the following error messages:  (see below)  No other
> error messages on the whole kernel compilation. I inform about this
> that the drivers can be corrected

Please at least cc: the developers involved so that they get the error
report.  These are being worked on and will be resolved before 2.6.29 is
released.

thanks,

greg k-h

^ permalink raw reply	[flat|nested] 2+ messages in thread

end of thread, other threads:[~2009-01-21  6:54 UTC | newest]

Thread overview: 2+ messages (download: mbox.gz / follow: Atom feed)
-- links below jump to the message on this page --
2009-01-18 14:48 info: errors on compiling staging drivers We La
2009-01-21  6:50 ` Greg KH

This is a public inbox, see mirroring instructions
for how to clone and mirror all data and code used for this inbox

all inboxes | Powered by JetHome®