* Latest git won't compile
@ 2007-09-15 20:20 Adrian McMenamin
2007-09-16 11:00 ` Adrian McMenamin
0 siblings, 1 reply; 2+ messages in thread
From: Adrian McMenamin @ 2007-09-15 20:20 UTC (permalink / raw)
To: linux-kernel
CC drivers/char/tty_ioctl.o
drivers/char/tty_ioctl.c: In function 'n_tty_ioctl':
drivers/char/tty_ioctl.c:799: error: implicit declaration of function
'kernel_termios_to_user_termios_1'
drivers/char/tty_ioctl.c:806: error: implicit declaration of function
'user_termios_to_kernel_termios_1'
make[2]: *** [drivers/char/tty_ioctl.o] Error 1
make[1]: *** [drivers/char] Error 2
make: *** [drivers] Error 2
^ permalink raw reply [flat|nested] 2+ messages in thread
* Re: Latest git won't compile
2007-09-15 20:20 Latest git won't compile Adrian McMenamin
@ 2007-09-16 11:00 ` Adrian McMenamin
0 siblings, 0 replies; 2+ messages in thread
From: Adrian McMenamin @ 2007-09-16 11:00 UTC (permalink / raw)
To: linux-kernel
On 15/09/2007, Adrian McMenamin <lkmladrian@gmail.com> wrote:
> CC drivers/char/tty_ioctl.o
> drivers/char/tty_ioctl.c: In function 'n_tty_ioctl':
> drivers/char/tty_ioctl.c:799: error: implicit declaration of function
> 'kernel_termios_to_user_termios_1'
> drivers/char/tty_ioctl.c:806: error: implicit declaration of function
> 'user_termios_to_kernel_termios_1'
> make[2]: *** [drivers/char/tty_ioctl.o] Error 1
> make[1]: *** [drivers/char] Error 2
> make: *** [drivers] Error 2
>
This morning's git does compile (SH4) and I see a fix went in...
^ permalink raw reply [flat|nested] 2+ messages in thread
end of thread, other threads:[~2007-09-16 11:00 UTC | newest]
Thread overview: 2+ messages (download: mbox.gz / follow: Atom feed)
-- links below jump to the message on this page --
2007-09-15 20:20 Latest git won't compile Adrian McMenamin
2007-09-16 11:00 ` Adrian McMenamin
This is a public inbox, see mirroring instructions
for how to clone and mirror all data and code used for this inbox
all inboxes | Powered by JetHome®